Task 60411492
| Name | LL-dc_84.21-84.29M_wu_184_4 |
| Workunit | 54182777 |
| Created | 21 Oct 2026, 5:18:31 UTC |
| Sent | 21 Oct 2026, 7:47:38 UTC |
| Report deadline | 3 Nov 2026, 7:47:38 UTC |
| Received | 21 Oct 2026, 8:09:02 UTC |
| Server state | Over |
| Outcome | Computation error |
| Client state | Compute error |
| Exit status | 195 (0xc3) EXIT_CHILD_FAILED |
| Computer ID | 249002 |
| Run time | 4 sec |
| CPU time |
|
| Validate state | Invalid |
| Credit | 0.00 |
| Device peak FLOPS | 303.52 GFLOPS |
| Application version | LL - dc v0.14 (opencl_ati_200) |
| Peak disk usage | 2.10 MB |
Stderr output
<core_client_version>8.3.0</core_client_version>
<![CDATA[
<message>
(unknown error) (0) - exit code 195 (0xc3)</message>
<stderr_txt>
2026-10-21 08:52:41 (1408): wrapper: running prpll.exe (-d 0)
2026-10-21 08:52:41 (1408): wrapper: created child process 4924
20261021 08:52:42 PRPLL v8 Windows_x64 2026-10-17 starting
20261021 08:52:42 config: -d 0
20261021 08:52:42 device 0, OpenCL 3584.0 (PAL,HSAIL), Radeon RX 560 Series, unique id ''
20261021 08:52:42 No FFTs found in tune.txt that can handle 84239371. Consider tuning with -tune
20261021 08:52:42 84239371 No FFTs found in tune.txt that can handle 84239371. Consider tuning with -tune
20261021 08:52:43 84239371 config:
20261021 08:52:44 84239371 FFT: 1.75M 4:256:14:256:101 (45.91 bpw)
20261021 08:52:45 84239371 LL loaded @ 0 : 0000000000000004
20261021 08:52:46 84239371 In file included from C:\Users\peter\AppData\Local\Temp\\OCL4924T5.cl:1:
In file included from C:\Users\peter\AppData\Local\Temp/fftp.cl:5:
In file included from C:\Users\peter\AppData\Local\Temp/fftwidth.cl:20:
C:\Users\peter\AppData\Local\Temp/fftbase.cl:1329:19: error: use of undeclared identifier '__asm'
if (HOIST == 2) OPAQUE(me); // Twiddle loads not issued before the butterflies preceding this call (see HOIST_W/H)
^
C:\Users\peter\AppData\Local\Temp/base.cl:1094:19: note: expanded from macro 'OPAQUE'
#define OPAQUE(x) __asm volatile("" : "+v"(x))
^
In file included from C:\Users\peter\AppData\Local\Temp\\OCL4924T5.cl:1:
In file included from C:\Users\peter\AppData\Local\Temp/fftp.cl:5:
In file included from C:\Users\peter\AppData\Local\Temp/fftwidth.cl:20:
C:\Users\peter\AppData\Local\Temp/fftbase.cl:1358:19: error: use of undeclared identifier '__asm'
if (HOIST == 2) OPAQUE(me); // Twiddle loads not issued before the butterflies preceding this call (see HOIST_W/H)
^
C:\Users\peter\AppData\Local\Temp/base.cl:1094:19: note: expanded from macro 'OPAQUE'
#define OPAQUE(x) __asm volatile("" : "+v"(x))
^
In file included from C:\Users\peter\AppData\Local\Temp\\OCL4924T5.cl:1:
In file included from C:\Users\peter\AppData\Local\Temp/fftp.cl:5:
In file included from C:\Users\peter\AppData\Local\Temp/fftwidth.cl:20:
C:\Users\peter\AppData\Local\Temp/fftbase.cl:1897:21: error: use of undeclared identifier '__asm'
if (HOIST >= 1) OPAQUE(me);
^
C:\Users\peter\AppData\Local\Temp/base.cl:1094:19: note: expanded from macro 'OPAQUE'
#define OPAQUE(x) __asm volatile("" : "+v"(x))
^
In file included from C:\Users\peter\AppData\Local\Temp\\OCL4924T5.cl:1:
In file included from C:\Users\peter\AppData\Local\Temp/fftp.cl:5:
In file included from C:\Users\peter\AppData\Local\Temp/fftwidth.cl:20:
C:\Users\peter\AppData\Local\Temp/fftbase.cl:1913:21: error: use of undeclared identifier '__asm'
if (HOIST >= 1) OPAQUE(me); // This step's LDS addresses and twiddle loads are not computed before the step starts (see HOIST_W/H)
^
C:\Users\peter\AppData\Local\Temp/base.cl:1094:19: note: expanded from macro 'OPAQUE'
#define OPAQUE(x) __asm volatile("" : "+v"(x))
^
In file included from C:\Users\peter\AppData\Local\Temp\\OCL4924T5.cl:1:
In file included from C:\Users\peter\AppData\Local\Temp/fftp.cl:5:
In file included from C:\Users\peter\AppData\Local\Temp/fftwidth.cl:20:
C:\Users\peter\AppData\Local\Temp/fftbase.cl:1973:19: error: use of undeclared identifier '__asm'
if (HOIST == 2) OPAQUE(me); // Twiddle loads not issued before the butterflies preceding this call (see HOIST_W/H)
^
C:\Users\peter\AppData\Local\Temp/base.cl:1094:19: note: expanded from macro 'OPAQUE'
#define OPAQUE(x) __asm volatile("" : "+v"(x))
^
In file included from C:\Users\peter\AppData\Local\Temp\\OCL4924T5.cl:1:
In file included from C:\Users\peter\AppData\Local\Temp/fftp.cl:5:
In file included from C:\Users\peter\AppData\Local\Temp/fftwidth.cl:20:
C:\Users\peter\AppData\Local\Temp/fftbase.cl:1997:19: error: use of undeclared identifier '__asm'
if (HOIST == 2) OPAQUE(me); // Twiddle loads not issued before the butterflies preceding this call (see HOIST_W/H)
^
C:\Users\peter\AppData\Local\Temp/base.cl:1094:19: note: expanded from macro 'OPAQUE'
#define OPAQUE(x) __asm volatile("" : "+v"(x))
^
In file included from C:\Users\peter\AppData\Local\Temp\\OCL4924T5.cl:1:
In file included from C:\Users\peter\AppData\Local\Temp/fftp.cl:5:
In file included from C:\Users\peter\AppData\Local\Temp/fftwidth.cl:20:
C:\Users\peter\AppData\Local\Temp/fftbase.cl:2166:21: error: use of undeclared identifier '__asm'
if (HOIST >= 1) OPAQUE(me); // This step's LDS addresses and twiddle loads are not computed before the step starts (see HOIST_W/H)
^
C:\Users\peter\AppData\Local\Temp/base.cl:1094:19: note: expanded from macro 'OPAQUE'
#define OPAQUE(x) __asm volatile("" : "+v"(x))
^
In file included from C:\Users\peter\AppData\Local\Temp\\OCL4924T5.cl:1:
In file included from C:\Users\peter\AppData\Local\Temp/fftp.cl:5:
In file included from C:\Users\peter\AppData\Local\Temp/fftwidth.cl:20:
C:\Users\peter\AppData\Local\Temp/fftbase.cl:2225:19: error: use of undeclared identifier '__asm'
if (HOIST == 2) OPAQUE(me); // Twiddle loads not issued before the butterflies preceding this call (see HOIST_W/H)
^
C:\Users\peter\AppData\Local\Temp/base.cl:1094:19: note: expanded from macro 'OPAQUE'
#define OPAQUE(x) __asm volatile("" : "+v"(x))
^
In file included from C:\Users\peter\AppData\Local\Temp\\OCL4924T5.cl:1:
In file included from C:\Users\peter\AppData\Local\Temp/fftp.cl:5:
In file included from C:\Users\peter\AppData\Local\Temp/fftwidth.cl:20:
C:\Users\peter\AppData\Local\Temp/fftbase.cl:2249:19: error: use of undeclared identifier '__asm'
if (HOIST == 2) OPAQUE(me); // Twiddle loads not issued before the butterflies preceding this call (see HOIST_W/H)
^
C:\Users\peter\AppData\Local\Temp/base.cl:1094:19: note: expanded from macro 'OPAQUE'
#define OPAQUE(x) __asm volatile("" : "+v"(x))
^
In file included from C:\Users\peter\AppData\Local\Temp\\OCL4924T5.cl:1:
In file included from C:\Users\peter\AppData\Local\Temp/fftp.cl:5:
In file included from C:\Users\peter\AppData\Local\Temp/fftwidth.cl:20:
C:\Users\peter\AppData\Local\Temp/fftbase.cl:2418:21: error: use of undeclared identifier '__asm'
if (HOIST >= 1) OPAQUE(me); // This step's LDS addresses and twiddle loads are not computed before the step starts (see HOIST_W/H)
^
C:\Users\peter\AppData\Local\Temp/base.cl:1094:19: note: expanded from macro 'OPAQUE'
#define OPAQUE(x) __asm volatile("" : "+v"(x))
^
10 errors generated.
error: Clang front-end compilation failed!
Frontend phase failed compilation.
Error: Compiling CL to IR
20261021 08:52:46 84239371 Compiling 'fftp.cl' error COMPILE_PROGRAM_FAILURE (-15) (args -cl-finite-math-only -cl-std=CL2.0 -DEXP=84239371ull -DWIDTH=256u -DSMALL_HEIGHT=256u -DMIDDLE=14u -DCARRY_LEN=8u -DNW=4u -DNH=4u -DAMDGPU=1 -DWAVEFRONT=64u -DCARRY64=1 -DCARRY_SUB_X=1 -DFFT_VARIANT=101u -DMAXBPW=5039u -DSTATS_SIZE=100000u -DWEIGHT_STEP=0.066723277310516541 -DIWEIGHT_STEP=-0.062549752808191333 -DTAILT=U2(-7.52981578e-05f,0.0122715384f) -DTRIG_SCALE=1.52587891e-05f -DTRIG_SIN={0.448798954f,-5.42732081e-09f,-0.0150662027f,0.000151708286f,-7.15217311e-07f,} -DTRIG_COS={1.00000000f,-0.100710250f,0.00169042510f,-1.13484766e-05f,4.02643643e-08f,} -DTAILTGF31=U2(509684486u,293249438u) -DTAILTGF61=U2(249938719029223731ull,1245372627562045535ull) -DPFA=7u -DPFA_LINV=2u -DPFA_BHINV=1u -DPFA_RINV31=9u -DPFA_W31=1205362885u -DPFA_RINV61=35u -DPFA_W61=1165310750493918737ull -DFFT_TYPE=4 -DWordSize=8u -DDISTGF31=573440u -DDISTWTRIGGF31=115392u -DDISTMTRIGGF31=1920u -DDISTHTRIGGF31=115392u -DDISTGF61=1146880ull -DDISTWTRIGGF61=230656ull -DDISTMTRIGGF61=3840ull -DDISTHTRIGGF61=230656ull -DFRAC_BPW_HI=3894736603u -DFRAC_BPW_LO=1840700268u -DFFT_FP64=0 -DFFT_FP32=1 -DNTT_GF31=1 -DNTT_GF61=1 )
20261021 08:52:46 84239371 Can't compile fftp.cl
20261021 08:52:46 84239371 Can't build FFT 4:256:14:256:101 (Can't compile fftp.cl), trying the next untuned FFT
20261021 08:52:46 84239371 config:
20261021 08:52:46 84239371 Using CARRY64
20261021 08:52:46 84239371 FFT: 2.25M 1:256:9:512:101 (35.71 bpw)
20261021 08:52:48 84239371 LL loaded @ 0 : 0000000000000004
20261021 08:52:49 84239371 In file included from C:\Users\peter\AppData\Local\Temp\\OCL4924T10.cl:1:
In file included from C:\Users\peter\AppData\Local\Temp/fftp.cl:5:
In file included from C:\Users\peter\AppData\Local\Temp/fftwidth.cl:20:
C:\Users\peter\AppData\Local\Temp/fftbase.cl:1973:19: error: use of undeclared identifier '__asm'
if (HOIST == 2) OPAQUE(me); // Twiddle loads not issued before the butterflies preceding this call (see HOIST_W/H)
^
C:\Users\peter\AppData\Local\Temp/base.cl:1094:19: note: expanded from macro 'OPAQUE'
#define OPAQUE(x) __asm volatile("" : "+v"(x))
^
In file included from C:\Users\peter\AppData\Local\Temp\\OCL4924T10.cl:1:
In file included from C:\Users\peter\AppData\Local\Temp/fftp.cl:5:
In file included from C:\Users\peter\AppData\Local\Temp/fftwidth.cl:20:
C:\Users\peter\AppData\Local\Temp/fftbase.cl:1997:19: error: use of undeclared identifier '__asm'
if (HOIST == 2) OPAQUE(me); // Twiddle loads not issued before the butterflies preceding this call (see HOIST_W/H)
^
C:\Users\peter\AppData\Local\Temp/base.cl:1094:19: note: expanded from macro 'OPAQUE'
#define OPAQUE(x) __asm volatile("" : "+v"(x))
^
In file included from C:\Users\peter\AppData\Local\Temp\\OCL4924T10.cl:1:
In file included from C:\Users\peter\AppData\Local\Temp/fftp.cl:5:
In file included from C:\Users\peter\AppData\Local\Temp/fftwidth.cl:20:
C:\Users\peter\AppData\Local\Temp/fftbase.cl:2166:21: error: use of undeclared identifier '__asm'
if (HOIST >= 1) OPAQUE(me); // This step's LDS addresses and twiddle loads are not computed before the step starts (see HOIST_W/H)
^
C:\Users\peter\AppData\Local\Temp/base.cl:1094:19: note: expanded from macro 'OPAQUE'
#define OPAQUE(x) __asm volatile("" : "+v"(x))
^
In file included from C:\Users\peter\AppData\Local\Temp\\OCL4924T10.cl:1:
In file included from C:\Users\peter\AppData\Local\Temp/fftp.cl:5:
In file included from C:\Users\peter\AppData\Local\Temp/fftwidth.cl:20:
C:\Users\peter\AppData\Local\Temp/fftbase.cl:2225:19: error: use of undeclared identifier '__asm'
if (HOIST == 2) OPAQUE(me); // Twiddle loads not issued before the butterflies preceding this call (see HOIST_W/H)
^
C:\Users\peter\AppData\Local\Temp/base.cl:1094:19: note: expanded from macro 'OPAQUE'
#define OPAQUE(x) __asm volatile("" : "+v"(x))
^
In file included from C:\Users\peter\AppData\Local\Temp\\OCL4924T10.cl:1:
In file included from C:\Users\peter\AppData\Local\Temp/fftp.cl:5:
In file included from C:\Users\peter\AppData\Local\Temp/fftwidth.cl:20:
C:\Users\peter\AppData\Local\Temp/fftbase.cl:2249:19: error: use of undeclared identifier '__asm'
if (HOIST == 2) OPAQUE(me); // Twiddle loads not issued before the butterflies preceding this call (see HOIST_W/H)
^
C:\Users\peter\AppData\Local\Temp/base.cl:1094:19: note: expanded from macro 'OPAQUE'
#define OPAQUE(x) __asm volatile("" : "+v"(x))
^
In file included from C:\Users\peter\AppData\Local\Temp\\OCL4924T10.cl:1:
In file included from C:\Users\peter\AppData\Local\Temp/fftp.cl:5:
In file included from C:\Users\peter\AppData\Local\Temp/fftwidth.cl:20:
C:\Users\peter\AppData\Local\Temp/fftbase.cl:2418:21: error: use of undeclared identifier '__asm'
if (HOIST >= 1) OPAQUE(me); // This step's LDS addresses and twiddle loads are not computed before the step starts (see HOIST_W/H)
^
C:\Users\peter\AppData\Local\Temp/base.cl:1094:19: note: expanded from macro 'OPAQUE'
#define OPAQUE(x) __asm volatile("" : "+v"(x))
^
6 errors generated.
error: Clang front-end compilation failed!
Frontend phase failed compilation.
Error: Compiling CL to IR
20261021 08:52:49 84239371 Compiling 'fftp.cl' error COMPILE_PROGRAM_FAILURE (-15) (args -cl-finite-math-only -cl-std=CL2.0 -DEXP=84239371ull -DWIDTH=256u -DSMALL_HEIGHT=512u -DMIDDLE=9u -DCARRY_LEN=8u -DNW=4u -DNH=8u -DAMDGPU=1 -DWAVEFRONT=64u -DCARRY64=1 -DMUL3_CARRY64=1 -DFFT_VARIANT=101u -DMAXBPW=3963u -DSTATS_SIZE=100000u -DTAILTGF31=U2(269176336u,500380354u) -DTAILTGF61=U2(807738046998073027ull,30095103403839256ull) -DPFA=9u -DPFA_LINV=2u -DPFA_BHINV=8u -DPFA_RINV31=7u -DPFA_W31=309107220u -DPFA_RINV61=34u -DPFA_W61=1102844585000305877ull -DFFT_TYPE=1 -DWordSize=8u -DDISTGF31=0 -DDISTWTRIGGF31=0 -DDISTMTRIGGF31=0 -DDISTHTRIGGF31=0 -DDISTGF61=737280ull -DDISTWTRIGGF61=128ull -DDISTMTRIGGF61=2432ull -DDISTHTRIGGF61=74560ull -DFRAC_BPW_HI=3029239580u -DFRAC_BPW_LO=1908874352u -DFFT_FP64=0 -DFFT_FP32=0 -DNTT_GF31=1 -DNTT_GF61=1 )
20261021 08:52:49 84239371 Can't compile fftp.cl
20261021 08:52:49 84239371 Can't build FFT 1:256:9:512:101 (Can't compile fftp.cl), trying the next untuned FFT
20261021 08:52:49 84239371 config:
20261021 08:52:49 84239371 Using CARRY64
20261021 08:52:49 84239371 FFT: 2.50M 2:1K:5:256:101 (32.13 bpw)
20261021 08:52:51 84239371 LL loaded @ 0 : 0000000000000004
20261021 08:52:51 84239371 In file included from C:\Users\peter\AppData\Local\Temp\\OCL4924T15.cl:1:
In file included from C:\Users\peter\AppData\Local\Temp/fftp.cl:5:
In file included from C:\Users\peter\AppData\Local\Temp/fftwidth.cl:20:
C:\Users\peter\AppData\Local\Temp/fftbase.cl:1329:19: error: use of undeclared identifier '__asm'
if (HOIST == 2) OPAQUE(me); // Twiddle loads not issued before the butterflies preceding this call (see HOIST_W/H)
^
C:\Users\peter\AppData\Local\Temp/base.cl:1094:19: note: expanded from macro 'OPAQUE'
#define OPAQUE(x) __asm volatile("" : "+v"(x))
^
In file included from C:\Users\peter\AppData\Local\Temp\\OCL4924T15.cl:1:
In file included from C:\Users\peter\AppData\Local\Temp/fftp.cl:5:
In file included from C:\Users\peter\AppData\Local\Temp/fftwidth.cl:20:
C:\Users\peter\AppData\Local\Temp/fftbase.cl:1358:19: error: use of undeclared identifier '__asm'
if (HOIST == 2) OPAQUE(me); // Twiddle loads not issued before the butterflies preceding this call (see HOIST_W/H)
^
C:\Users\peter\AppData\Local\Temp/base.cl:1094:19: note: expanded from macro 'OPAQUE'
#define OPAQUE(x) __asm volatile("" : "+v"(x))
^
In file included from C:\Users\peter\AppData\Local\Temp\\OCL4924T15.cl:1:
In file included from C:\Users\peter\AppData\Local\Temp/fftp.cl:5:
In file included from C:\Users\peter\AppData\Local\Temp/fftwidth.cl:20:
C:\Users\peter\AppData\Local\Temp/fftbase.cl:1857:19: error: use of undeclared identifier '__asm'
if (HOIST >= 1) OPAQUE(me); // This step's LDS addresses and twiddle loads are not computed before the step starts (see HOIST_W/H)
^
C:\Users\peter\AppData\Local\Temp/base.cl:1094:19: note: expanded from macro 'OPAQUE'
#define OPAQUE(x) __asm volatile("" : "+v"(x))
^
In file included from C:\Users\peter\AppData\Local\Temp\\OCL4924T15.cl:1:
In file included from C:\Users\peter\AppData\Local\Temp/fftp.cl:5:
In file included from C:\Users\peter\AppData\Local\Temp/fftwidth.cl:20:
C:\Users\peter\AppData\Local\Temp/fftbase.cl:1863:19: error: use of undeclared identifier '__asm'
if (HOIST >= 1) OPAQUE(me);
^
C:\Users\peter\AppData\Local\Temp/base.cl:1094:19: note: expanded from macro 'OPAQUE'
#define OPAQUE(x) __asm volatile("" : "+v"(x))
^
In file included from C:\Users\peter\AppData\Local\Temp\\OCL4924T15.cl:1:
In file included from C:\Users\peter\AppData\Local\Temp/fftp.cl:5:
In file included from C:\Users\peter\AppData\Local\Temp/fftwidth.cl:20:
C:\Users\peter\AppData\Local\Temp/fftbase.cl:2225:19: error: use of undeclared identifier '__asm'
if (HOIST == 2) OPAQUE(me); // Twiddle loads not issued before the butterflies preceding this call (see HOIST_W/H)
^
C:\Users\peter\AppData\Local\Temp/base.cl:1094:19: note: expanded from macro 'OPAQUE'
#define OPAQUE(x) __asm volatile("" : "+v"(x))
^
In file included from C:\Users\peter\AppData\Local\Temp\\OCL4924T15.cl:1:
In file included from C:\Users\peter\AppData\Local\Temp/fftp.cl:5:
In file included from C:\Users\peter\AppData\Local\Temp/fftwidth.cl:20:
C:\Users\peter\AppData\Local\Temp/fftbase.cl:2249:19: error: use of undeclared identifier '__asm'
if (HOIST == 2) OPAQUE(me); // Twiddle loads not issued before the butterflies preceding this call (see HOIST_W/H)
^
C:\Users\peter\AppData\Local\Temp/base.cl:1094:19: note: expanded from macro 'OPAQUE'
#define OPAQUE(x) __asm volatile("" : "+v"(x))
^
In file included from C:\Users\peter\AppData\Local\Temp\\OCL4924T15.cl:1:
In file included from C:\Users\peter\AppData\Local\Temp/fftp.cl:5:
In file included from C:\Users\peter\AppData\Local\Temp/fftwidth.cl:20:
C:\Users\peter\AppData\Local\Temp/fftbase.cl:2376:19: error: use of undeclared identifier '__asm'
if (HOIST >= 1) OPAQUE(me); // This step's LDS addresses and twiddle loads are not computed before the step starts (see HOIST_W/H)
^
C:\Users\peter\AppData\Local\Temp/base.cl:1094:19: note: expanded from macro 'OPAQUE'
#define OPAQUE(x) __asm volatile("" : "+v"(x))
^
In file included from C:\Users\peter\AppData\Local\Temp\\OCL4924T15.cl:1:
In file included from C:\Users\peter\AppData\Local\Temp/fftp.cl:5:
In file included from C:\Users\peter\AppData\Local\Temp/fftwidth.cl:20:
C:\Users\peter\AppData\Local\Temp/fftbase.cl:2382:19: error: use of undeclared identifier '__asm'
if (HOIST >= 1) OPAQUE(me);
^
C:\Users\peter\AppData\Local\Temp/base.cl:1094:19: note: expanded from macro 'OPAQUE'
#define OPAQUE(x) __asm volatile("" : "+v"(x))
^
8 errors generated.
error: Clang front-end compilation failed!
Frontend phase failed compilation.
Error: Compiling CL to IR
20261021 08:52:51 84239371 Compiling 'fftp.cl' error COMPILE_PROGRAM_FAILURE (-15) (args -cl-finite-math-only -cl-std=CL2.0 -DEXP=84239371ull -DWIDTH=1024u -DSMALL_HEIGHT=256u -DMIDDLE=5u -DCARRY_LEN=8u -DNW=8u -DNH=4u -DAMDGPU=1 -DWAVEFRONT=64u -DCARRY64=1 -DMUL3_CARRY64=1 -DFFT_VARIANT=101u -DMAXBPW=3462u -DSTATS_SIZE=100000u -DWEIGHT_STEP=0.82163028112031844 -DIWEIGHT_STEP=-0.45104118527004761 -DTAILT=U2(-7.52981578e-05f,0.0122715384f) -DTRIG_SCALE=7.62939453e-06f -DTRIG_SIN={0.628318548f,-1.95191774e-08f,-0.0413416624f,0.000815923559f,-7.53935637e-06f,} -DTRIG_COS={1.00000000f,-0.197392091f,0.00649393676f,-8.54487662e-05f,5.94217113e-07f,} -DTAILTGF61=U2(249938719029223731ull,1245372627562045535ull) -DPFA=5u -DPFA_LINV=4u -DPFA_BHINV=1u -DPFA_RINV61=49u -DPFA_W61=725554454131936870ull -DFFT_TYPE=2 -DWordSize=8u -DDISTGF61=819200ull -DDISTWTRIGGF61=2560ull -DDISTMTRIGGF61=1152ull -DDISTHTRIGGF61=164544ull -DFRAC_BPW_HI=578831974u -DFRAC_BPW_LO=1717986917u -DFFT_FP64=0 -DFFT_FP32=1 -DNTT_GF31=0 -DNTT_GF61=1 )
20261021 08:52:51 84239371 Can't compile fftp.cl
20261021 08:52:51 84239371 Can't build FFT 2:1K:5:256:101 (Can't compile fftp.cl), trying the next untuned FFT
20261021 08:52:51 84239371 config:
20261021 08:52:51 84239371 Using CARRY64
20261021 08:52:52 84239371 FFT: 2.75M 51:256:11:512:101 (29.21 bpw)
20261021 08:52:53 84239371 LL loaded @ 0 : 0000000000000004
20261021 08:52:54 84239371 In file included from C:\Users\peter\AppData\Local\Temp\\OCL4924T20.cl:1:
In file included from C:\Users\peter\AppData\Local\Temp/fftp.cl:5:
In file included from C:\Users\peter\AppData\Local\Temp/fftwidth.cl:20:
C:\Users\peter\AppData\Local\Temp/fftbase.cl:268:21: error: use of undeclared identifier '__asm'
if (HOIST == 2) { OPAQUE_F64(w.x); OPAQUE_F64(w.y); } // Power chain not computed before the butterflies preceding this call (see HOIST_W/H)
^
C:\Users\peter\AppData\Local\Temp/base.cl:1095:23: note: expanded from macro 'OPAQUE_F64'
#define OPAQUE_F64(x) __asm volatile("" : "+v"(x))
^
In file included from C:\Users\peter\AppData\Local\Temp\\OCL4924T20.cl:1:
In file included from C:\Users\peter\AppData\Local\Temp/fftp.cl:5:
In file included from C:\Users\peter\AppData\Local\Temp/fftwidth.cl:20:
C:\Users\peter\AppData\Local\Temp/fftbase.cl:268:38: error: use of undeclared identifier '__asm'
if (HOIST == 2) { OPAQUE_F64(w.x); OPAQUE_F64(w.y); } // Power chain not computed before the butterflies preceding this call (see HOIST_W/H)
^
C:\Users\peter\AppData\Local\Temp/base.cl:1095:23: note: expanded from macro 'OPAQUE_F64'
#define OPAQUE_F64(x) __asm volatile("" : "+v"(x))
^
In file included from C:\Users\peter\AppData\Local\Temp\\OCL4924T20.cl:1:
In file included from C:\Users\peter\AppData\Local\Temp/fftp.cl:5:
In file included from C:\Users\peter\AppData\Local\Temp/fftwidth.cl:20:
C:\Users\peter\AppData\Local\Temp/fftbase.cl:355:19: error: use of undeclared identifier '__asm'
if (HOIST == 2) OPAQUE(me); // Twiddle loads not issued before the butterflies preceding this call (see HOIST_W/H)
^
C:\Users\peter\AppData\Local\Temp/base.cl:1094:19: note: expanded from macro 'OPAQUE'
#define OPAQUE(x) __asm volatile("" : "+v"(x))
^
In file included from C:\Users\peter\AppData\Local\Temp\\OCL4924T20.cl:1:
In file included from C:\Users\peter\AppData\Local\Temp/fftp.cl:5:
In file included from C:\Users\peter\AppData\Local\Temp/fftwidth.cl:20:
C:\Users\peter\AppData\Local\Temp/fftbase.cl:408:19: error: use of undeclared identifier '__asm'
if (HOIST == 2) OPAQUE(me); // Twiddle loads not issued before the butterflies preceding this call (see HOIST_W/H)
^
C:\Users\peter\AppData\Local\Temp/base.cl:1094:19: note: expanded from macro 'OPAQUE'
#define OPAQUE(x) __asm volatile("" : "+v"(x))
^
In file included from C:\Users\peter\AppData\Local\Temp\\OCL4924T20.cl:1:
In file included from C:\Users\peter\AppData\Local\Temp/fftp.cl:5:
In file included from C:\Users\peter\AppData\Local\Temp/fftwidth.cl:20:
C:\Users\peter\AppData\Local\Temp/fftbase.cl:581:19: error: use of undeclared identifier '__asm'
if (HOIST >= 2) OPAQUE(me); // The next stage's preloads are not issued before this point (see HOIST_W/H)
^
C:\Users\peter\AppData\Local\Temp/base.cl:1094:19: note: expanded from macro 'OPAQUE'
#define OPAQUE(x) __asm volatile("" : "+v"(x))
^
In file included from C:\Users\peter\AppData\Local\Temp\\OCL4924T20.cl:1:
In file included from C:\Users\peter\AppData\Local\Temp/fftp.cl:5:
In file included from C:\Users\peter\AppData\Local\Temp/fftwidth.cl:20:
C:\Users\peter\AppData\Local\Temp/fftbase.cl:638:19: error: use of undeclared identifier '__asm'
if (HOIST >= 2) OPAQUE(me); // The next stage's preloads are not issued before this point (see HOIST_W/H)
^
C:\Users\peter\AppData\Local\Temp/base.cl:1094:19: note: expanded from macro 'OPAQUE'
#define OPAQUE(x) __asm volatile("" : "+v"(x))
^
In file included from C:\Users\peter\AppData\Local\Temp\\OCL4924T20.cl:1:
In file included from C:\Users\peter\AppData\Local\Temp/fftp.cl:5:
In file included from C:\Users\peter\AppData\Local\Temp/fftwidth.cl:20:
C:\Users\peter\AppData\Local\Temp/fftbase.cl:694:19: error: use of undeclared identifier '__asm'
if (HOIST >= 2) OPAQUE(me); // The next stage's preloads are not issued before this point (see HOIST_W/H)
^
C:\Users\peter\AppData\Local\Temp/base.cl:1094:19: note: expanded from macro 'OPAQUE'
#define OPAQUE(x) __asm volatile("" : "+v"(x))
^
In file included from C:\Users\peter\AppData\Local\Temp\\OCL4924T20.cl:1:
In file included from C:\Users\peter\AppData\Local\Temp/fftp.cl:5:
In file included from C:\Users\peter\AppData\Local\Temp/fftwidth.cl:20:
C:\Users\peter\AppData\Local\Temp/fftbase.cl:759:21: error: use of undeclared identifier '__asm'
if (HOIST >= 2) OPAQUE(me); // The next stage's preloads are not issued before this point (see HOIST_W/H)
^
C:\Users\peter\AppData\Local\Temp/base.cl:1094:19: note: expanded from macro 'OPAQUE'
#define OPAQUE(x) __asm volatile("" : "+v"(x))
^
In file included from C:\Users\peter\AppData\Local\Temp\\OCL4924T20.cl:1:
In file included from C:\Users\peter\AppData\Local\Temp/fftp.cl:5:
In file included from C:\Users\peter\AppData\Local\Temp/fftwidth.cl:20:
C:\Users\peter\AppData\Local\Temp/fftbase.cl:791:21: error: use of undeclared identifier '__asm'
if (HOIST >= 2) OPAQUE(me); // The next stage's preloads are not issued before this point (see HOIST_W/H)
^
C:\Users\peter\AppData\Local\Temp/base.cl:1094:19: note: expanded from macro 'OPAQUE'
#define OPAQUE(x) __asm volatile("" : "+v"(x))
^
In file included from C:\Users\peter\AppData\Local\Temp\\OCL4924T20.cl:1:
In file included from C:\Users\peter\AppData\Local\Temp/fftp.cl:5:
In file included from C:\Users\peter\AppData\Local\Temp/fftwidth.cl:20:
C:\Users\peter\AppData\Local\Temp/fftbase.cl:1234:21: error: use of undeclared identifier '__asm'
if (HOIST >= 1) OPAQUE(me);
^
C:\Users\peter\AppData\Local\Temp/base.cl:1094:19: note: expanded from macro 'OPAQUE'
#define OPAQUE(x) __asm volatile("" : "+v"(x))
^
In file included from C:\Users\peter\AppData\Local\Temp\\OCL4924T20.cl:1:
In file included from C:\Users\peter\AppData\Local\Temp/fftp.cl:5:
In file included from C:\Users\peter\AppData\Local\Temp/fftwidth.cl:20:
C:\Users\peter\AppData\Local\Temp/fftbase.cl:1235:39: error: use of undeclared identifier '__asm'
if (HOIST >= 1 && VARIANT == 0) { OPAQUE_F64(w.x); OPAQUE_F64(w.y); }
^
C:\Users\peter\AppData\Local\Temp/base.cl:1095:23: note: expanded from macro 'OPAQUE_F64'
#define OPAQUE_F64(x) __asm volatile("" : "+v"(x))
^
In file included from C:\Users\peter\AppData\Local\Temp\\OCL4924T20.cl:1:
In file included from C:\Users\peter\AppData\Local\Temp/fftp.cl:5:
In file included from C:\Users\peter\AppData\Local\Temp/fftwidth.cl:20:
C:\Users\peter\AppData\Local\Temp/fftbase.cl:1235:56: error: use of undeclared identifier '__asm'
if (HOIST >= 1 && VARIANT == 0) { OPAQUE_F64(w.x); OPAQUE_F64(w.y); }
^
C:\Users\peter\AppData\Local\Temp/base.cl:1095:23: note: expanded from macro 'OPAQUE_F64'
#define OPAQUE_F64(x) __asm volatile("" : "+v"(x))
^
In file included from C:\Users\peter\AppData\Local\Temp\\OCL4924T20.cl:1:
In file included from C:\Users\peter\AppData\Local\Temp/fftp.cl:5:
In file included from C:\Users\peter\AppData\Local\Temp/fftwidth.cl:20:
C:\Users\peter\AppData\Local\Temp/fftbase.cl:1252:21: error: use of undeclared identifier '__asm'
if (HOIST >= 1) OPAQUE(me); // This step's LDS addresses and twiddle loads are not computed before the step starts (see HOIST_W/H)
^
C:\Users\peter\AppData\Local\Temp/base.cl:1094:19: note: expanded from macro 'OPAQUE'
#define OPAQUE(x) __asm volatile("" : "+v"(x))
^
In file included from C:\Users\peter\AppData\Local\Temp\\OCL4924T20.cl:1:
In file included from C:\Users\peter\AppData\Local\Temp/fftp.cl:5:
In file included from C:\Users\peter\AppData\Local\Temp/fftwidth.cl:20:
C:\Users\peter\AppData\Local\Temp/fftbase.cl:1253:39: error: use of undeclared identifier '__asm'
if (HOIST >= 1 && VARIANT == 0) { OPAQUE_F64(w.x); OPAQUE_F64(w.y); } // Nor its twiddle power chain
^
C:\Users\peter\AppData\Local\Temp/base.cl:1095:23: note: expanded from macro 'OPAQUE_F64'
#define OPAQUE_F64(x) __asm volatile("" : "+v"(x))
^
In file included from C:\Users\peter\AppData\Local\Temp\\OCL4924T20.cl:1:
In file included from C:\Users\peter\AppData\Local\Temp/fftp.cl:5:
In file included from C:\Users\peter\AppData\Local\Temp/fftwidth.cl:20:
C:\Users\peter\AppData\Local\Temp/fftbase.cl:1253:56: error: use of undeclared identifier '__asm'
if (HOIST >= 1 && VARIANT == 0) { OPAQUE_F64(w.x); OPAQUE_F64(w.y); } // Nor its twiddle power chain
^
C:\Users\peter\AppData\Local\Temp/base.cl:1095:23: note: expanded from macro 'OPAQUE_F64'
#define OPAQUE_F64(x) __asm volatile("" : "+v"(x))
^
In file included from C:\Users\peter\AppData\Local\Temp\\OCL4924T20.cl:1:
In file included from C:\Users\peter\AppData\Local\Temp/fftp.cl:5:
In file included from C:\Users\peter\AppData\Local\Temp/fftwidth.cl:20:
C:\Users\peter\AppData\Local\Temp/fftbase.cl:1973:19: error: use of undeclared identifier '__asm'
if (HOIST == 2) OPAQUE(me); // Twiddle loads not issued before the butterflies preceding this call (see HOIST_W/H)
^
C:\Users\peter\AppData\Local\Temp/base.cl:1094:19: note: expanded from macro 'OPAQUE'
#define OPAQUE(x) __asm volatile("" : "+v"(x))
^
In file included from C:\Users\peter\AppData\Local\Temp\\OCL4924T20.cl:1:
In file included from C:\Users\peter\AppData\Local\Temp/fftp.cl:5:
In file included from C:\Users\peter\AppData\Local\Temp/fftwidth.cl:20:
C:\Users\peter\AppData\Local\Temp/fftbase.cl:1997:19: error: use of undeclared identifier '__asm'
if (HOIST == 2) OPAQUE(me); // Twiddle loads not issued before the butterflies preceding this call (see HOIST_W/H)
^
C:\Users\peter\AppData\Local\Temp/base.cl:1094:19: note: expanded from macro 'OPAQUE'
#define OPAQUE(x) __asm volatile("" : "+v"(x))
^
In file included from C:\Users\peter\AppData\Local\Temp\\OCL4924T20.cl:1:
In file included from C:\Users\peter\AppData\Local\Temp/fftp.cl:5:
In file included from C:\Users\peter\AppData\Local\Temp/fftwidth.cl:20:
C:\Users\peter\AppData\Local\Temp/fftbase.cl:2166:21: error: use of undeclared identifier '__asm'
if (HOIST >= 1) OPAQUE(me); // This step's LDS addresses and twiddle loads are not computed before the step starts (see HOIST_W/H)
^
C:\Users\peter\AppData\Local\Temp/base.cl:1094:19: note: expanded from macro 'OPAQUE'
#define OPAQUE(x) __asm volatile("" : "+v"(x))
^
18 errors generated.
error: Clang front-end compilation failed!
Frontend phase failed compilation.
Error: Compiling CL to IR
20261021 08:52:54 84239371 Compiling 'fftp.cl' error COMPILE_PROGRAM_FAILURE (-15) (args -cl-finite-math-only -cl-std=CL2.0 -DEXP=84239371ull -DWIDTH=256u -DSMALL_HEIGHT=512u -DMIDDLE=11u -DCARRY_LEN=8u -DNW=4u -DNH=8u -DAMDGPU=1 -DWAVEFRONT=64u -DCARRY64=1 -DMUL3_CARRY64=1 -DFFT_VARIANT=101u -DMAXBPW=3409u -DSTATS_SIZE=100000u -DWEIGHT_STEP=0.72497193520252146 -DIWEIGHT_STEP=-0.42028042335506499 -DTAILT=U2(-1.8824717398890911e-05,0.0061358846491544753) -DTRIG_SCALE=13 -DTRIG_SIN={3.3522307427570831e-07,-1.2563750003736832e-24,-6.2784214256363043e-21,3.5276726415399086e-35,-9.4385829203836991e-50,1.4731332310453353e-64,-1.5048548786217372e-79,1.0732889266281846e-94,} -DTRIG_COS={1,-5.6187254763428522e-14,5.2616793297505444e-28,-1.97092877987088e-42,3.95503846604331e-57,-4.9382785316349927e-72,4.2032744514730063e-87,-2.5377621968447027e-102,} -DTAILTGF31=U2(269176336u,500380354u) -DPFA=11u -DPFA_LINV=8u -DPFA_BHINV=2u -DPFA_RINV31=17u -DPFA_W31=1969212174u -DFFT_TYPE=51 -DWordSize=8u -DDISTGF31=1802240u -DDISTWTRIGGF31=1280u -DDISTMTRIGGF31=5888u -DDISTHTRIGGF31=182912u -DFRAC_BPW_HI=916662458u -DFRAC_BPW_LO=780903143u -DFFT_FP64=1 -DFFT_FP32=0 -DNTT_GF31=1 -DNTT_GF61=0 )
20261021 08:52:54 84239371 Can't compile fftp.cl
20261021 08:52:54 84239371 Can't build FFT 51:256:11:512:101 (Can't compile fftp.cl), trying the next untuned FFT
20261021 08:52:54 84239371 config:
20261021 08:52:54 84239371 Using CARRY64
20261021 08:52:54 84239371 FFT: 3.50M 3:1K:7:256:101 (22.95 bpw)
20261021 08:52:56 84239371 LL loaded @ 0 : 0000000000000004
20261021 08:52:56 84239371 In file included from C:\Users\peter\AppData\Local\Temp\\OCL4924T25.cl:1:
In file included from C:\Users\peter\AppData\Local\Temp/fftp.cl:5:
In file included from C:\Users\peter\AppData\Local\Temp/fftwidth.cl:20:
C:\Users\peter\AppData\Local\Temp/fftbase.cl:2225:19: error: use of undeclared identifier '__asm'
if (HOIST == 2) OPAQUE(me); // Twiddle loads not issued before the butterflies preceding this call (see HOIST_W/H)
^
C:\Users\peter\AppData\Local\Temp/base.cl:1094:19: note: expanded from macro 'OPAQUE'
#define OPAQUE(x) __asm volatile("" : "+v"(x))
^
In file included from C:\Users\peter\AppData\Local\Temp\\OCL4924T25.cl:1:
In file included from C:\Users\peter\AppData\Local\Temp/fftp.cl:5:
In file included from C:\Users\peter\AppData\Local\Temp/fftwidth.cl:20:
C:\Users\peter\AppData\Local\Temp/fftbase.cl:2249:19: error: use of undeclared identifier '__asm'
if (HOIST == 2) OPAQUE(me); // Twiddle loads not issued before the butterflies preceding this call (see HOIST_W/H)
^
C:\Users\peter\AppData\Local\Temp/base.cl:1094:19: note: expanded from macro 'OPAQUE'
#define OPAQUE(x) __asm volatile("" : "+v"(x))
^
In file included from C:\Users\peter\AppData\Local\Temp\\OCL4924T25.cl:1:
In file included from C:\Users\peter\AppData\Local\Temp/fftp.cl:5:
In file included from C:\Users\peter\AppData\Local\Temp/fftwidth.cl:20:
C:\Users\peter\AppData\Local\Temp/fftbase.cl:2376:19: error: use of undeclared identifier '__asm'
if (HOIST >= 1) OPAQUE(me); // This step's LDS addresses and twiddle loads are not computed before the step starts (see HOIST_W/H)
^
C:\Users\peter\AppData\Local\Temp/base.cl:1094:19: note: expanded from macro 'OPAQUE'
#define OPAQUE(x) __asm volatile("" : "+v"(x))
^
In file included from C:\Users\peter\AppData\Local\Temp\\OCL4924T25.cl:1:
In file included from C:\Users\peter\AppData\Local\Temp/fftp.cl:5:
In file included from C:\Users\peter\AppData\Local\Temp/fftwidth.cl:20:
C:\Users\peter\AppData\Local\Temp/fftbase.cl:2382:19: error: use of undeclared identifier '__asm'
if (HOIST >= 1) OPAQUE(me);
^
C:\Users\peter\AppData\Local\Temp/base.cl:1094:19: note: expanded from macro 'OPAQUE'
#define OPAQUE(x) __asm volatile("" : "+v"(x))
^
4 errors generated.
error: Clang front-end compilation failed!
Frontend phase failed compilation.
Error: Compiling CL to IR
20261021 08:52:56 84239371 Compiling 'fftp.cl' error COMPILE_PROGRAM_FAILURE (-15) (args -cl-finite-math-only -cl-std=CL2.0 -DEXP=84239371ull -DWIDTH=1024u -DSMALL_HEIGHT=256u -DMIDDLE=7u -DCARRY_LEN=8u -DNW=8u -DNH=4u -DAMDGPU=1 -DWAVEFRONT=64u -DCARRY64=1 -DMUL3_CARRY64=1 -DFFT_VARIANT=101u -DMAXBPW=2389u -DSTATS_SIZE=100000u -DTAILTGF61=U2(249938719029223731ull,1245372627562045535ull) -DPFA=7u -DPFA_LINV=1u -DPFA_BHINV=2u -DPFA_RINV61=35u -DPFA_W61=1165310750493918737ull -DFFT_TYPE=3 -DWordSize=4u -DDISTGF61=0 -DDISTWTRIGGF61=0 -DDISTMTRIGGF61=0 -DDISTHTRIGGF61=0 -DFRAC_BPW_HI=4094851949u -DFRAC_BPW_LO=3067833781u -DFFT_FP64=0 -DFFT_FP32=0 -DNTT_GF31=0 -DNTT_GF61=1 )
20261021 08:52:56 84239371 Can't compile fftp.cl
20261021 08:52:56 84239371 Can't build FFT 3:1K:7:256:101 (Can't compile fftp.cl), trying the next untuned FFT
20261021 08:52:56 84239371 config:
20261021 08:52:56 84239371 FFT: 4.50M 1K:9:256:101 (17.85 bpw)
20261021 08:52:57 84239371 LL loaded @ 0 : 0000000000000004
20261021 08:52:58 84239371 In file included from C:\Users\peter\AppData\Local\Temp\\OCL4924T30.cl:1:
In file included from C:\Users\peter\AppData\Local\Temp/fftp.cl:5:
In file included from C:\Users\peter\AppData\Local\Temp/fftwidth.cl:20:
C:\Users\peter\AppData\Local\Temp/fftbase.cl:268:21: error: use of undeclared identifier '__asm'
if (HOIST == 2) { OPAQUE_F64(w.x); OPAQUE_F64(w.y); } // Power chain not computed before the butterflies preceding this call (see HOIST_W/H)
^
C:\Users\peter\AppData\Local\Temp/base.cl:1095:23: note: expanded from macro 'OPAQUE_F64'
#define OPAQUE_F64(x) __asm volatile("" : "+v"(x))
^
In file included from C:\Users\peter\AppData\Local\Temp\\OCL4924T30.cl:1:
In file included from C:\Users\peter\AppData\Local\Temp/fftp.cl:5:
In file included from C:\Users\peter\AppData\Local\Temp/fftwidth.cl:20:
C:\Users\peter\AppData\Local\Temp/fftbase.cl:268:38: error: use of undeclared identifier '__asm'
if (HOIST == 2) { OPAQUE_F64(w.x); OPAQUE_F64(w.y); } // Power chain not computed before the butterflies preceding this call (see HOIST_W/H)
^
C:\Users\peter\AppData\Local\Temp/base.cl:1095:23: note: expanded from macro 'OPAQUE_F64'
#define OPAQUE_F64(x) __asm volatile("" : "+v"(x))
^
In file included from C:\Users\peter\AppData\Local\Temp\\OCL4924T30.cl:1:
In file included from C:\Users\peter\AppData\Local\Temp/fftp.cl:5:
In file included from C:\Users\peter\AppData\Local\Temp/fftwidth.cl:20:
C:\Users\peter\AppData\Local\Temp/fftbase.cl:355:19: error: use of undeclared identifier '__asm'
if (HOIST == 2) OPAQUE(me); // Twiddle loads not issued before the butterflies preceding this call (see HOIST_W/H)
^
C:\Users\peter\AppData\Local\Temp/base.cl:1094:19: note: expanded from macro 'OPAQUE'
#define OPAQUE(x) __asm volatile("" : "+v"(x))
^
In file included from C:\Users\peter\AppData\Local\Temp\\OCL4924T30.cl:1:
In file included from C:\Users\peter\AppData\Local\Temp/fftp.cl:5:
In file included from C:\Users\peter\AppData\Local\Temp/fftwidth.cl:20:
C:\Users\peter\AppData\Local\Temp/fftbase.cl:408:19: error: use of undeclared identifier '__asm'
if (HOIST == 2) OPAQUE(me); // Twiddle loads not issued before the butterflies preceding this call (see HOIST_W/H)
^
C:\Users\peter\AppData\Local\Temp/base.cl:1094:19: note: expanded from macro 'OPAQUE'
#define OPAQUE(x) __asm volatile("" : "+v"(x))
^
In file included from C:\Users\peter\AppData\Local\Temp\\OCL4924T30.cl:1:
In file included from C:\Users\peter\AppData\Local\Temp/fftp.cl:5:
In file included from C:\Users\peter\AppData\Local\Temp/fftwidth.cl:20:
C:\Users\peter\AppData\Local\Temp/fftbase.cl:581:19: error: use of undeclared identifier '__asm'
if (HOIST >= 2) OPAQUE(me); // The next stage's preloads are not issued before this point (see HOIST_W/H)
^
C:\Users\peter\AppData\Local\Temp/base.cl:1094:19: note: expanded from macro 'OPAQUE'
#define OPAQUE(x) __asm volatile("" : "+v"(x))
^
In file included from C:\Users\peter\AppData\Local\Temp\\OCL4924T30.cl:1:
In file included from C:\Users\peter\AppData\Local\Temp/fftp.cl:5:
In file included from C:\Users\peter\AppData\Local\Temp/fftwidth.cl:20:
C:\Users\peter\AppData\Local\Temp/fftbase.cl:638:19: error: use of undeclared identifier '__asm'
if (HOIST >= 2) OPAQUE(me); // The next stage's preloads are not issued before this point (see HOIST_W/H)
^
C:\Users\peter\AppData\Local\Temp/base.cl:1094:19: note: expanded from macro 'OPAQUE'
#define OPAQUE(x) __asm volatile("" : "+v"(x))
^
In file included from C:\Users\peter\AppData\Local\Temp\\OCL4924T30.cl:1:
In file included from C:\Users\peter\AppData\Local\Temp/fftp.cl:5:
In file included from C:\Users\peter\AppData\Local\Temp/fftwidth.cl:20:
C:\Users\peter\AppData\Local\Temp/fftbase.cl:694:19: error: use of undeclared identifier '__asm'
if (HOIST >= 2) OPAQUE(me); // The next stage's preloads are not issued before this point (see HOIST_W/H)
^
C:\Users\peter\AppData\Local\Temp/base.cl:1094:19: note: expanded from macro 'OPAQUE'
#define OPAQUE(x) __asm volatile("" : "+v"(x))
^
In file included from C:\Users\peter\AppData\Local\Temp\\OCL4924T30.cl:1:
In file included from C:\Users\peter\AppData\Local\Temp/fftp.cl:5:
In file included from C:\Users\peter\AppData\Local\Temp/fftwidth.cl:20:
C:\Users\peter\AppData\Local\Temp/fftbase.cl:759:21: error: use of undeclared identifier '__asm'
if (HOIST >= 2) OPAQUE(me); // The next stage's preloads are not issued before this point (see HOIST_W/H)
^
C:\Users\peter\AppData\Local\Temp/base.cl:1094:19: note: expanded from macro 'OPAQUE'
#define OPAQUE(x) __asm volatile("" : "+v"(x))
^
In file included from C:\Users\peter\AppData\Local\Temp\\OCL4924T30.cl:1:
In file included from C:\Users\peter\AppData\Local\Temp/fftp.cl:5:
In file included from C:\Users\peter\AppData\Local\Temp/fftwidth.cl:20:
C:\Users\peter\AppData\Local\Temp/fftbase.cl:791:21: error: use of undeclared identifier '__asm'
if (HOIST >= 2) OPAQUE(me); // The next stage's preloads are not issued before this point (see HOIST_W/H)
^
C:\Users\peter\AppData\Local\Temp/base.cl:1094:19: note: expanded from macro 'OPAQUE'
#define OPAQUE(x) __asm volatile("" : "+v"(x))
^
In file included from C:\Users\peter\AppData\Local\Temp\\OCL4924T30.cl:1:
In file included from C:\Users\peter\AppData\Local\Temp/fftp.cl:5:
In file included from C:\Users\peter\AppData\Local\Temp/fftwidth.cl:20:
C:\Users\peter\AppData\Local\Temp/fftbase.cl:1143:19: error: use of undeclared identifier '__asm'
if (HOIST >= 1) OPAQUE(me); // This step's LDS addresses and twiddle loads are not computed before the step starts (see HOIST_W/H)
^
C:\Users\peter\AppData\Local\Temp/base.cl:1094:19: note: expanded from macro 'OPAQUE'
#define OPAQUE(x) __asm volatile("" : "+v"(x))
^
In file included from C:\Users\peter\AppData\Local\Temp\\OCL4924T30.cl:1:
In file included from C:\Users\peter\AppData\Local\Temp/fftp.cl:5:
In file included from C:\Users\peter\AppData\Local\Temp/fftwidth.cl:20:
C:\Users\peter\AppData\Local\Temp/fftbase.cl:1144:37: error: use of undeclared identifier '__asm'
if (HOIST >= 1 && VARIANT == 0) { OPAQUE_F64(w.x); OPAQUE_F64(w.y); } // Nor its twiddle power chain
^
C:\Users\peter\AppData\Local\Temp/base.cl:1095:23: note: expanded from macro 'OPAQUE_F64'
#define OPAQUE_F64(x) __asm volatile("" : "+v"(x))
^
In file included from C:\Users\peter\AppData\Local\Temp\\OCL4924T30.cl:1:
In file included from C:\Users\peter\AppData\Local\Temp/fftp.cl:5:
In file included from C:\Users\peter\AppData\Local\Temp/fftwidth.cl:20:
C:\Users\peter\AppData\Local\Temp/fftbase.cl:1144:54: error: use of undeclared identifier '__asm'
if (HOIST >= 1 && VARIANT == 0) { OPAQUE_F64(w.x); OPAQUE_F64(w.y); } // Nor its twiddle power chain
^
C:\Users\peter\AppData\Local\Temp/base.cl:1095:23: note: expanded from macro 'OPAQUE_F64'
#define OPAQUE_F64(x) __asm volatile("" : "+v"(x))
^
In file included from C:\Users\peter\AppData\Local\Temp\\OCL4924T30.cl:1:
In file included from C:\Users\peter\AppData\Local\Temp/fftp.cl:5:
In file included from C:\Users\peter\AppData\Local\Temp/fftwidth.cl:20:
C:\Users\peter\AppData\Local\Temp/fftbase.cl:1151:19: error: use of undeclared identifier '__asm'
if (HOIST >= 1) OPAQUE(me);
^
C:\Users\peter\AppData\Local\Temp/base.cl:1094:19: note: expanded from macro 'OPAQUE'
#define OPAQUE(x) __asm volatile("" : "+v"(x))
^
In file included from C:\Users\peter\AppData\Local\Temp\\OCL4924T30.cl:1:
In file included from C:\Users\peter\AppData\Local\Temp/fftp.cl:5:
In file included from C:\Users\peter\AppData\Local\Temp/fftwidth.cl:20:
C:\Users\peter\AppData\Local\Temp/fftbase.cl:1152:37: error: use of undeclared identifier '__asm'
if (HOIST >= 1 && VARIANT == 0) { OPAQUE_F64(w.x); OPAQUE_F64(w.y); }
^
C:\Users\peter\AppData\Local\Temp/base.cl:1095:23: note: expanded from macro 'OPAQUE_F64'
#define OPAQUE_F64(x) __asm volatile("" : "+v"(x))
^
In file included from C:\Users\peter\AppData\Local\Temp\\OCL4924T30.cl:1:
In file included from C:\Users\peter\AppData\Local\Temp/fftp.cl:5:
In file included from C:\Users\peter\AppData\Local\Temp/fftwidth.cl:20:
C:\Users\peter\AppData\Local\Temp/fftbase.cl:1152:54: error: use of undeclared identifier '__asm'
if (HOIST >= 1 && VARIANT == 0) { OPAQUE_F64(w.x); OPAQUE_F64(w.y); }
^
C:\Users\peter\AppData\Local\Temp/base.cl:1095:23: note: expanded from macro 'OPAQUE_F64'
#define OPAQUE_F64(x) __asm volatile("" : "+v"(x))
^
15 errors generated.
error: Clang front-end compilation failed!
Frontend phase failed compilation.
Error: Compiling CL to IR
20261021 08:52:58 84239371 Compiling 'fftp.cl' error COMPILE_PROGRAM_FAILURE (-15) (args -cl-finite-math-only -cl-std=CL2.0 -DEXP=84239371ull -DWIDTH=1024u -DSMALL_HEIGHT=256u -DMIDDLE=9u -DCARRY_LEN=8u -DNW=8u -DNH=4u -DAMDGPU=1 -DWAVEFRONT=64u -DMUL3_CARRY64=1 -DFFT_VARIANT=101u -DMAXBPW=1832u -DSTATS_SIZE=100000u -DWEIGHT_STEP=0.10753331740557202 -DIWEIGHT_STEP=-0.097092625310335454 -DTAILT=U2(-7.5298160855497009e-05,0.012271538285719925) -DTRIG_SCALE=1 -DTRIG_SIN={2.6631610900792381e-06,1.4883747621832373e-22,-3.1480459330925343e-18,1.1163642973494475e-30,-1.8851743502184128e-43,1.8570081824820527e-56,-1.1972736315754154e-69,5.3893637621327227e-83,} -DTRIG_COS={1,-3.5462134958560183e-12,2.0959383596985676e-24,-4.9550965984355041e-37,6.2756537264299188e-50,-4.9455128286169281e-63,2.6571941905707354e-76,-1.0281997869321099e-89,} -DFFT_TYPE=0 -DWordSize=4u -DFRAC_BPW_HI=3662103438u -DFRAC_BPW_LO=954437175u -DFFT_FP64=1 -DFFT_FP32=0 -DNTT_GF31=0 -DNTT_GF61=0 )
20261021 08:52:58 84239371 Can't compile fftp.cl
20261021 08:52:58 Exception "Can't compile fftp.cl"
20261021 08:52:58 Bye
2026-10-21 08:52:59 (1408): prpll.exe exited; CPU time 9.031250
2026-10-21 08:52:59 (1408): app exit status: 0x1
2026-10-21 08:52:59 (1408): called boinc_finish(195)
</stderr_txt>
]]>
Main page · Your account · Message boards
Copyright © 2014-2026 BOINC Confederation / rebirther